Target
Mitogen-activated protein kinase kinase kinase 5
Ligand
BDBM464036
Substrate
Meas. Tech.
In Vitro Enzyme Activity
IC50
525±n/a nM
Citation
 Wu, CYu, TLi, NChen, S ASK1 inhibitor and preparation method and use thereof US Patent  US10787435 Publication Date 9/29/2020 
Target
Name:
Mitogen-activated protein kinase kinase kinase 5
Synonyms:
ASK1 MAP3K5 MEKK5
Type:
Protein
Mol. Mass.:
154514.93
Organism:
Homo sapiens (Human)
Description:
Q99683
Residue:
1374
  
Inhibitor
Name:
BDBM464036
Synonyms:
US10787435, Example 016 | WX016
Type:
Small organic molecule
Emp. Form.:
C26H26N8O
Mol. Mass.:
466.5376
SMILES:
CC(C)n1c(C)nnc1-c1cccc(n1)-n1cnc2cc(C)c(cc2c1=O)-n1cnc(c1)C1CC1
: