Target
Mitogen-activated protein kinase kinase kinase 5
Ligand
BDBM464071
Substrate
Meas. Tech.
In Vitro Enzyme Activity
IC50
525±n/a nM
Citation
 Wu, CYu, TLi, NChen, S ASK1 inhibitor and preparation method and use thereof US Patent  US10787435 Publication Date 9/29/2020 
Target
Name:
Mitogen-activated protein kinase kinase kinase 5
Synonyms:
ASK1 MAP3K5 MEKK5
Type:
Protein
Mol. Mass.:
154514.93
Organism:
Homo sapiens (Human)
Description:
Q99683
Residue:
1374
  
Inhibitor
Name:
BDBM464071
Synonyms:
US10787435, Example 049 | WX048
Type:
Small organic molecule
Emp. Form.:
C28H26F2N8O
Mol. Mass.:
528.5558
SMILES:
Cc1cc2ncn(-c3cccc(n3)-c3nncn3C3CCC(F)(F)CC3)c(=O)c2cc1-n1cnc(c1)C1CC1
: