Target
Mitogen-activated protein kinase kinase kinase 5
Ligand
BDBM464076
Substrate
Meas. Tech.
In Vitro Enzyme Activity
IC50
<50±n/a nM
Citation
 Wu, CYu, TLi, NChen, S ASK1 inhibitor and preparation method and use thereof US Patent  US10787435 Publication Date 9/29/2020 
Target
Name:
Mitogen-activated protein kinase kinase kinase 5
Synonyms:
ASK1 MAP3K5 MEKK5
Type:
Protein
Mol. Mass.:
154514.93
Organism:
Homo sapiens (Human)
Description:
Q99683
Residue:
1374
  
Inhibitor
Name:
BDBM464076
Synonyms:
US10787435, Example 054 | WX053
Type:
Small organic molecule
Emp. Form.:
C27H27FN8O2
Mol. Mass.:
514.5541
SMILES:
CC(C)n1cnnc1-c1cccc(n1)-n1cnc2cc(OCCCF)c(cc2c1=O)-n1cnc(c1)C1CC1
: