Target
Ketohexokinase
Ligand
BDBM319585
Substrate
Meas. Tech.
Biological Assay
IC50
8.40±n/a nM
Citation
 Dowling, MFernando, DFutatsugi, KHuard, KMagee, TVRaymer, BShavnya, ASmith, AThuma, BTsai, ATu, M Substituted 3-azabicyclo[3.1.0]hexanes as ketohexokinase inhibitors US Patent  US10787438 Publication Date 9/29/2020 
Target
Name:
Ketohexokinase
Synonyms:
Hepatic fructokinase KHK_HUMAN Ketohexokinase (KHK) | Ketohexokinase (KHK) Isoform C
Type:
Enzyme Catalytic Domain
Mol. Mass.:
32521.64
Organism:
Homo sapiens (Human)
Description:
Residue:
298
  
Inhibitor
Name:
BDBM319585
Synonyms:
US10174007, Example 4 US10988463, Example 4 | US11634410, Example 4
Type:
Small organic molecule
Emp. Form.:
C16H19F3N4O2
Mol. Mass.:
356.3429
SMILES:
C[C@H]1CCN1c1nc(cc(n1)C(F)(F)F)N1C[C@H]2[C@H](CC(O)=O)[C@H]2C1
: