Target
Ketohexokinase
Ligand
BDBM464138
Substrate
Meas. Tech.
Biological Assay
IC50
2.60±n/a nM
Citation
 Dowling, MFernando, DFutatsugi, KHuard, KMagee, TVRaymer, BShavnya, ASmith, AThuma, BTsai, ATu, M Substituted 3-azabicyclo[3.1.0]hexanes as ketohexokinase inhibitors US Patent  US10787438 Publication Date 9/29/2020 
Target
Name:
Ketohexokinase
Synonyms:
Hepatic fructokinase KHK_HUMAN Ketohexokinase (KHK) | Ketohexokinase (KHK) Isoform C
Type:
Enzyme Catalytic Domain
Mol. Mass.:
32521.64
Organism:
Homo sapiens (Human)
Description:
Residue:
298
  
Inhibitor
Name:
BDBM464138
Synonyms:
US10787438, Example 50 | [(1R,5S,6R)-3-{5-cyano-4-(1,1-difluoroethyl)-3-fluoro-6-[(2S, 3R)-3-hydroxy-2-methylazetidin-1-yl]pyridin-2-yl}-3-azabicyclo[3.1.0]hex-6- yl]acetic acid
Type:
Small organic molecule
Emp. Form.:
C18H19F3N4O3
Mol. Mass.:
396.3637
SMILES:
C[C@H]1[C@H](O)CN1c1nc(N2C[C@H]3[C@H](CC(O)=O)[C@H]3C2)c(F)c(C(F)F)c1C#N
: