Target
Rho-associated protein kinase 2
Ligand
BDBM464255
Substrate
Meas. Tech.
In Vitro Assay
IC50
<3±n/a nM
Citation
 Bhide, RSBodas, MSShirude, PSPatil, SMaishal, TKThiyagarajan, KChinnakotti, KGlunz, PW Spiro-fused cyclic ureas as inhibitors of rock US Patent  US10787450 Publication Date 9/29/2020 
Target
Name:
Rho-associated protein kinase 2
Synonyms:
KIAA0619 ROCK2 Rho kinase 2 (ROCKII) Rho-associated protein kinase 2 (ROCK2) Rho-associated protein kinase 2/Transforming protein RhoA Rho-associated, coiled-coil-containing protein kinase II p164 ROCK-2
Type:
Protein
Mol. Mass.:
160885.43
Organism:
Homo sapiens (Human)
Description:
O75116
Residue:
1388
  
Inhibitor
Name:
BDBM464255
Synonyms:
3-(6-methoxy-5-(1H- pyrazol-4-yl)pyridin- 2-yl)-1-(3- methoxybenzyl)-8- (3,3,3- trifluoropropyl)-1,3,8- triazaspiro[4.5]decan- 2-one | US10787450, Example 136
Type:
Small organic molecule
Emp. Form.:
C27H31F3N6O3
Mol. Mass.:
544.5686
SMILES:
COc1cccc(CN2C(=O)N(CC22CCN(CCC(F)(F)F)CC2)c2ccc(-c3cn[nH]c3)c(OC)n2)c1
: