Target
Rho-associated protein kinase 2
Ligand
BDBM464321
Substrate
Meas. Tech.
In Vitro Assay
IC50
<3±n/a nM
Citation
 Bhide, RSBodas, MSShirude, PSPatil, SMaishal, TKThiyagarajan, KChinnakotti, KGlunz, PW Spiro-fused cyclic ureas as inhibitors of rock US Patent  US10787450 Publication Date 9/29/2020 
Target
Name:
Rho-associated protein kinase 2
Synonyms:
KIAA0619 ROCK2 Rho kinase 2 (ROCKII) Rho-associated protein kinase 2 (ROCK2) Rho-associated protein kinase 2/Transforming protein RhoA Rho-associated, coiled-coil-containing protein kinase II p164 ROCK-2
Type:
Protein
Mol. Mass.:
160885.43
Organism:
Homo sapiens (Human)
Description:
O75116
Residue:
1388
  
Inhibitor
Name:
BDBM464321
Synonyms:
8-(2- (dimethylamino) acetyl)-3-(6-ethyl-5-(1H- pyrazol-4-yl)pyridin- 2-yl)-1-(3- methoxybenzyl)- 1,3,8- triazaspiro[4.5]decan- 2-one | US10787450, Example 203
Type:
Small organic molecule
Emp. Form.:
C29H37N7O3
Mol. Mass.:
531.6492
SMILES:
CCc1nc(ccc1-c1cn[nH]c1)N1CC2(CCN(CC2)C(=O)CN(C)C)N(Cc2cccc(OC)c2)C1=O
: