Target
Serine/threonine-protein kinase ATR
Ligand
BDBM411662
Substrate
Meas. Tech.
Inhibition Assay
Ki
<10±n/a nM
Citation
 Ahmad, NBoyall, DCharrier, JDavis, CDavis, RDurrant, SEtxebarria I Jardi, GFraysse, DJimenez, JKay, DKnegtel, RMiddleton, DO''Donnell, MPanesar, MPierard, FPinder, JShaw, DStorck, PStudley, JTwin, H Compounds useful as inhibitors of ATR kinase US Patent  US10787452 Publication Date 9/29/2020 
Target
Name:
Serine/threonine-protein kinase ATR
Synonyms:
ATR Ataxia telangiectasia and Rad3-related protein (ATR) FRP1 | Serine-protein kinase ATR
Type:
Protein
Mol. Mass.:
301404.58
Organism:
Homo sapiens (Human)
Description:
Q13535
Residue:
2644
  
Inhibitor
Name:
BDBM411662
Synonyms:
US10392391, Compound I-N-91 US11117900, Compound I-N-91 US20230271963, Compound I-N-91
Type:
Small organic molecule
Emp. Form.:
C18H21ClN8O
Mol. Mass.:
400.865
SMILES:
NCC1CCN(CC1)c1ccncc1NC(=O)c1c(N)nn2cc(Cl)cnc12
: