Target
Serine/threonine-protein kinase ATR
Ligand
BDBM411886
Substrate
Meas. Tech.
Inhibition Assay
Ki
<10±n/a nM
Citation
 Ahmad, NBoyall, DCharrier, JDavis, CDavis, RDurrant, SEtxebarria I Jardi, GFraysse, DJimenez, JKay, DKnegtel, RMiddleton, DO''Donnell, MPanesar, MPierard, FPinder, JShaw, DStorck, PStudley, JTwin, H Compounds useful as inhibitors of ATR kinase US Patent  US10787452 Publication Date 9/29/2020 
Target
Name:
Serine/threonine-protein kinase ATR
Synonyms:
ATR Ataxia telangiectasia and Rad3-related protein (ATR) FRP1 | Serine-protein kinase ATR
Type:
Protein
Mol. Mass.:
301404.58
Organism:
Homo sapiens (Human)
Description:
Q13535
Residue:
2644
  
Inhibitor
Name:
BDBM411886
Synonyms:
US10392391, Compound I-O-31 US11117900, Compound I-O-31 US20230271963, Compound I-O-31
Type:
Small organic molecule
Emp. Form.:
C18H17N7O3
Mol. Mass.:
379.3727
SMILES:
Nc1nn2cc(CC#N)cnc2c1C(=O)Nc1cnccc1O[C@@H]1CCOC1
: