Target
Proto-oncogene tyrosine-protein kinase receptor Ret
Ligand
BDBM370367
Substrate
Meas. Tech.
Inhibitory Activity Assay
IC50
6.52±n/a nM
Citation
 Miyazaki, IShimamura, TKato, MFujita, H Fused pyrimidine compound or salt thereof US Patent  US10787457 Publication Date 9/29/2020 
Target
Name:
Proto-oncogene tyrosine-protein kinase receptor Ret
Synonyms:
CDHF12 Cadherin family member 12 Proto-oncogene c-Ret RET51 Tyrosine-protein kinase Ret (RET)
Type:
Protein
Mol. Mass.:
124318.29
Organism:
Homo sapiens (Human)
Description:
P07949
Residue:
1114
  
Inhibitor
Name:
BDBM370367
Synonyms:
US10233189, Example 13 US11014930, Example 13 | US11236096, Example 13
Type:
Small organic molecule
Emp. Form.:
C12H11F3N8O
Mol. Mass.:
340.2639
SMILES:
Cc1cc(NC(=O)c2nn(CC(F)(F)F)c3ncnc(N)c23)n[nH]1
: