Target
Proto-oncogene tyrosine-protein kinase receptor Ret
Ligand
BDBM464393
Substrate
Meas. Tech.
Inhibitory Activity Assay
IC50
2.03±n/a nM
Citation
 Miyazaki, IShimamura, TKato, MFujita, H Fused pyrimidine compound or salt thereof US Patent  US10787457 Publication Date 9/29/2020 
Target
Name:
Proto-oncogene tyrosine-protein kinase receptor Ret
Synonyms:
CDHF12 Cadherin family member 12 Proto-oncogene c-Ret RET51 Tyrosine-protein kinase Ret (RET)
Type:
Protein
Mol. Mass.:
124318.29
Organism:
Homo sapiens (Human)
Description:
P07949
Residue:
1114
  
Inhibitor
Name:
BDBM464393
Synonyms:
US10787457, Example 21
Type:
Small organic molecule
Emp. Form.:
C14H14F3N7O
Mol. Mass.:
353.3025
SMILES:
CC(C)n1cc(C(=O)Nc2cc([nH]n2)C(F)(F)F)c2c(N)ncnc12
: