Target
Proto-oncogene tyrosine-protein kinase receptor Ret
Ligand
BDBM370344
Substrate
Meas. Tech.
Inhibitory Activity Assay
IC50
1.000±n/a nM
Citation
 Miyazaki, IShimamura, TKato, MFujita, H Fused pyrimidine compound or salt thereof US Patent  US10787457 Publication Date 9/29/2020 
Target
Name:
Proto-oncogene tyrosine-protein kinase receptor Ret
Synonyms:
CDHF12 Cadherin family member 12 Proto-oncogene c-Ret RET51 Tyrosine-protein kinase Ret (RET)
Type:
Protein
Mol. Mass.:
124318.29
Organism:
Homo sapiens (Human)
Description:
P07949
Residue:
1114
  
Inhibitor
Name:
BDBM370344
Synonyms:
US10233189, Example 36 US11014930, Example 36 | US11236096, Example 36
Type:
Small organic molecule
Emp. Form.:
C14H15F3N8O
Mol. Mass.:
368.3171
SMILES:
CC(C)(C)n1nc(C(=O)Nc2cc([nH]n2)C(F)(F)F)c2c(N)ncnc12
: