Target
Proto-oncogene tyrosine-protein kinase receptor Ret
Ligand
BDBM464422
Substrate
Meas. Tech.
Inhibitory Activity Assay
IC50
0.360±n/a nM
Citation
 Miyazaki, IShimamura, TKato, MFujita, H Fused pyrimidine compound or salt thereof US Patent  US10787457 Publication Date 9/29/2020 
Target
Name:
Proto-oncogene tyrosine-protein kinase receptor Ret
Synonyms:
CDHF12 Cadherin family member 12 Proto-oncogene c-Ret RET51 Tyrosine-protein kinase Ret (RET)
Type:
Protein
Mol. Mass.:
124318.29
Organism:
Homo sapiens (Human)
Description:
P07949
Residue:
1114
  
Inhibitor
Name:
BDBM464422
Synonyms:
US10787457, Example 55 US11236096, Example 55
Type:
Small organic molecule
Emp. Form.:
C15H15F2N7O
Mol. Mass.:
347.3227
SMILES:
Cc1cc(NC(=O)c2cn(c3ncnc(N)c23)C2(CC2)C(F)F)n[nH]1
: