Target
Proto-oncogene tyrosine-protein kinase receptor Ret
Ligand
BDBM370354
Substrate
Meas. Tech.
Inhibitory Activity Assay
IC50
0.790±n/a nM
Citation
 Miyazaki, IShimamura, TKato, MFujita, H Fused pyrimidine compound or salt thereof US Patent  US10787457 Publication Date 9/29/2020 
Target
Name:
Proto-oncogene tyrosine-protein kinase receptor Ret
Synonyms:
CDHF12 Cadherin family member 12 Proto-oncogene c-Ret RET51 Tyrosine-protein kinase Ret (RET)
Type:
Protein
Mol. Mass.:
124318.29
Organism:
Homo sapiens (Human)
Description:
P07949
Residue:
1114
  
Inhibitor
Name:
BDBM370354
Synonyms:
US10233189, Example 70 US11014930, Example 70 | US11236096, Example 70
Type:
Small organic molecule
Emp. Form.:
C16H21N7O
Mol. Mass.:
327.3842
SMILES:
CCC(C)(C)n1cc(C(=O)Nc2cc(C)[nH]n2)c2c(N)ncnc12
: