Target
Proto-oncogene tyrosine-protein kinase receptor Ret
Ligand
BDBM370391
Substrate
Meas. Tech.
Inhibitory Activity Assay
IC50
0.150±n/a nM
Citation
 Miyazaki, IShimamura, TKato, MFujita, H Fused pyrimidine compound or salt thereof US Patent  US10787457 Publication Date 9/29/2020 
Target
Name:
Proto-oncogene tyrosine-protein kinase receptor Ret
Synonyms:
CDHF12 Cadherin family member 12 Proto-oncogene c-Ret RET51 Tyrosine-protein kinase Ret (RET)
Type:
Protein
Mol. Mass.:
124318.29
Organism:
Homo sapiens (Human)
Description:
P07949
Residue:
1114
  
Inhibitor
Name:
BDBM370391
Synonyms:
US10233189, Example 82 US11236096, Example 82
Type:
Small organic molecule
Emp. Form.:
C21H21N9O
Mol. Mass.:
415.4511
SMILES:
Cc1cc(NC(=O)c2c(C#Cc3cnn(C)c3)n(c3ncnc(N)c23)C2(C)CC2)[nH]n1
: