Target
Sodium channel protein type 10 subunit alpha
Ligand
BDBM161326
Substrate
Meas. Tech.
Electrophysiology Assay
IC50
3.00±n/a nM
Citation
 Anderson, CHadida Ruah, SSGolec, JMZhang, BLittler, BJKeshavarz-Shokri, AAlcacio, TEBelmont, DT Prodrugs of pyridone amides useful as modulators of sodium channels US Patent  US10787472 Publication Date 9/29/2020 
Target
Name:
Sodium channel protein type 10 subunit alpha
Synonyms:
PN3 SCN10A Sodium channel alpha subunit Sodium channel protein type X alpha subunit fret-membrane potential nav1.8 | hPN3
Type:
Enzyme
Mol. Mass.:
220609.21
Organism:
Homo sapiens (Human)
Description:
Q9Y5Y9
Residue:
1956
  
Inhibitor
Name:
BDBM161326
Synonyms:
US10087143, Compound 111 US10787472, Compound 2a US9051270, 111 US9758483, Compound 111
Type:
Small organic molecule
Emp. Form.:
C21H14F6N2O4
Mol. Mass.:
472.3373
SMILES:
COc1cc(F)ccc1Oc1cc(ccc1C(=O)Nc1cc[nH]c(=O)c1)C(F)(F)C(F)(F)F
: