Target
Sodium channel protein type 10 subunit alpha
Ligand
BDBM161245
Substrate
Meas. Tech.
Electrophysiology Assay
IC50
11.0±n/a nM
Citation
 Anderson, CHadida Ruah, SSGolec, JMZhang, BLittler, BJKeshavarz-Shokri, AAlcacio, TEBelmont, DT Prodrugs of pyridone amides useful as modulators of sodium channels US Patent  US10787472 Publication Date 9/29/2020 
Target
Name:
Sodium channel protein type 10 subunit alpha
Synonyms:
PN3 SCN10A Sodium channel alpha subunit Sodium channel protein type X alpha subunit fret-membrane potential nav1.8 | hPN3
Type:
Enzyme
Mol. Mass.:
220609.21
Organism:
Homo sapiens (Human)
Description:
Q9Y5Y9
Residue:
1956
  
Inhibitor
Name:
BDBM161245
Synonyms:
US10087143, Compound 30 US10787472, Compound 4a US9051270, 30 US9758483, Compound 30
Type:
Small organic molecule
Emp. Form.:
C20H14F4N2O4
Mol. Mass.:
422.3298
SMILES:
COc1cc(F)ccc1Oc1ccc(cc1C(=O)Nc1cc[nH]c(=O)c1)C(F)(F)F
: