Target
Neutral amino acid transporter B(0)
Ligand
BDBM464406
Substrate
Meas. Tech.
3H-Amino Acid Uptake Assays
IC50
10500±n/a nM
Citation
 Manning, HCSchulte, M Glutamine transport inhibitors and methods for treating cancer US Patent  US10793514 Publication Date 10/6/2020 
Target
Name:
Neutral amino acid transporter B(0)
Synonyms:
AAAT_HUMAN ASCT2 Baboon M7 virus receptor Neutral amino acid transporter B(0) RDR SLC1A5 Solute carrier family 1 member 5
Type:
PROTEIN
Mol. Mass.:
56592.12
Organism:
Homo sapiens (Human)
Description:
ChEMBL_109758
Residue:
541
  
Inhibitor
Name:
BDBM464406
Synonyms:
US10793514, Compound 10
Type:
Small organic molecule
Emp. Form.:
C31H31FN2O4
Mol. Mass.:
514.5872
SMILES:
Cc1ccc(Oc2ccccc2CN(CC[C@@H](N)C(O)=O)Cc2ccccc2Oc2ccc(F)cc2)cc1
: