Target
Neutral amino acid transporter B(0)
Ligand
BDBM464417
Substrate
Meas. Tech.
3H-Amino Acid Uptake Assays
IC50
41700±n/a nM
Citation
 Manning, HCSchulte, M Glutamine transport inhibitors and methods for treating cancer US Patent  US10793514 Publication Date 10/6/2020 
Target
Name:
Neutral amino acid transporter B(0)
Synonyms:
AAAT_HUMAN ASCT2 Baboon M7 virus receptor Neutral amino acid transporter B(0) RDR SLC1A5 Solute carrier family 1 member 5
Type:
PROTEIN
Mol. Mass.:
56592.12
Organism:
Homo sapiens (Human)
Description:
ChEMBL_109758
Residue:
541
  
Inhibitor
Name:
BDBM464417
Synonyms:
US10793514, Compound 16
Type:
Small organic molecule
Emp. Form.:
C34H38N2O4
Mol. Mass.:
538.6765
SMILES:
Cc1ccccc1COc1ccccc1CN(CC[C@@H](N)C(O)=O)Cc1ccccc1OCc1ccccc1C
: