Target
Amino acid transporter
Ligand
BDBM464428
Substrate
Meas. Tech.
3H-Amino Acid Uptake Assays
IC50
48300±n/a nM
Citation
 Manning, HCSchulte, M Glutamine transport inhibitors and methods for treating cancer US Patent  US10793514 Publication Date 10/6/2020 
Target
Name:
Amino acid transporter
Synonyms:
Amino acid transporter | Slc1a5
Type:
PROTEIN
Mol. Mass.:
56758.53
Organism:
Rattus norvegicus
Description:
ChEMBL_109757
Residue:
539
  
Inhibitor
Name:
BDBM464428
Synonyms:
US10793514, Compound 21
Type:
Small organic molecule
Emp. Form.:
C30H32N4O4
Mol. Mass.:
512.5995
SMILES:
N[C@H](CCN(Cc1ccccc1OCc1ccccn1)Cc1ccccc1OCc1ccccn1)C(O)=O
: