Target
Prepronociceptin
Ligand
BDBM464443
Substrate
Meas. Tech.
Receptor Binding Assay
Ki
3.60±n/a nM
Citation
 Kuehnert, SKoenigs, RMJakob, FKless, AWegert, ARatcliffe, PJostock, RKoch, TLinz, KSchroeder, W 3-((hetero-)aryl)-8-amino-2-oxo-1,3-diaza-spiro-[4.5]-decane derivatives US Patent  US10793528 Publication Date 10/6/2020 
Target
Name:
Prepronociceptin
Synonyms:
OFQ PNOC_HUMAN
Type:
Protein
Mol. Mass.:
20301.31
Organism:
Human
Description:
Q13519
Residue:
176
  
Inhibitor
Name:
BDBM464443
Synonyms:
US10793528, Example SC_5013
Type:
Small organic molecule
Emp. Form.:
C28H39N5O3
Mol. Mass.:
493.641
SMILES:
CN(C)[C@]1(CC[C@]2(CN(CCC(=O)NCc3ncco3)C(=O)N2CC2CCC2)CC1)c1ccccc1
: