Target
Prepronociceptin
Ligand
BDBM464480
Substrate
Meas. Tech.
Receptor Binding Assay
Ki
1.50±n/a nM
Citation
 Kuehnert, SKoenigs, RMJakob, FKless, AWegert, ARatcliffe, PJostock, RKoch, TLinz, KSchroeder, W 3-((hetero-)aryl)-8-amino-2-oxo-1,3-diaza-spiro-[4.5]-decane derivatives US Patent  US10793528 Publication Date 10/6/2020 
Target
Name:
Prepronociceptin
Synonyms:
OFQ PNOC_HUMAN
Type:
Protein
Mol. Mass.:
20301.31
Organism:
Human
Description:
Q13519
Residue:
176
  
Inhibitor
Name:
BDBM464480
Synonyms:
US10793528, Example SC_5049
Type:
Small organic molecule
Emp. Form.:
C25H38N4O2
Mol. Mass.:
426.5948
SMILES:
CNC(=O)CCN1C[C@]2(CC[C@@](CC2)(N(C)C)c2ccccc2)N(CC2CCC2)C1=O
: