Target
Prostacyclin receptor
Ligand
BDBM464510
Substrate
Meas. Tech.
HTRF assay
EC50
31.0±n/a nM
Citation
 Tran, THayashi, RIbarra, JBUllman, BZou, N Substituted pyridazines and 1,2,4-triazines as prostacyclin receptor modulators US Patent  US10793529 Publication Date 10/6/2020 
Target
Name:
Prostacyclin receptor
Synonyms:
PGI receptor PRIPR Prostacyclin (IP) Receptor Prostaglandin I Prostaglandin I2 receptor | Prostanoid IP receptor
Type:
G Protein-Coupled Receptor (GPCR)
Mol. Mass.:
40968.22
Organism:
Homo sapiens (Human)
Description:
The membranes prepared from human platelet were used in binding assay.
Residue:
386
  
Inhibitor
Name:
BDBM464510
Synonyms:
2-(((1s,4s,)-4-((4-(3-chloro- 2-fluorophenyl)-6-oxo-3- phenylpyridazin-1(6H)- yl)methyl)cyclohexyl) methoxy)acetic acid | US10793529, Compound 31
Type:
Small organic molecule
Emp. Form.:
C26H26ClFN2O4
Mol. Mass.:
484.947
SMILES:
OC(=O)COC[C@H]1CC[C@@H](Cn2nc(-c3ccccc3)c(cc2=O)-c2cccc(Cl)c2F)CC1
: