Target
Interleukin-1 receptor-associated kinase 4
Ligand
BDBM395287
Substrate
Meas. Tech.
Kinase Assay
IC50
136±n/a nM
Citation
 Bothe, USiebeneicher, HSchmidt, NNubbemeyer, RBömer, UGünther, JSteuber, HLange, MStegmann, CSutter, ARausch, AFriedrich, CHauff, P Substituted indazoles, methods for the production thereof, pharmaceutical preparations that contain said new substituted indazoles, and use of said new substituted indazoles to produce drugs US Patent  US10793545 Publication Date 10/6/2020 
Target
Name:
Interleukin-1 receptor-associated kinase 4
Synonyms:
IRAK-4 IRAK4_HUMAN Interleukin-1 receptor-associated kinase 4 (IRAK4) | Renal carcinoma antigen NY-REN-64
Type:
Protein
Mol. Mass.:
51519.08
Organism:
Homo sapiens (Human)
Description:
Q9NWZ3
Residue:
460
  
Inhibitor
Name:
BDBM395287
Synonyms:
N-[6-(Hydroxymethyl)-2-(2-methoxyethyl)-2H-indazol-5-yl]-6-(trifluoromethyl)pyridine-2-carboxamide US10793545, Example 2
Type:
Small organic molecule
Emp. Form.:
C18H17F3N4O3
Mol. Mass.:
394.3478
SMILES:
COCCn1cc2cc(NC(=O)c3cccc(n3)C(F)(F)F)c(CO)cc2n1
: