Target
Histone-lysine N-methyltransferase EZH2 [Y641F]/Polycomb protein EED/Polycomb protein SUZ12
Ligand
BDBM464527
Substrate
Meas. Tech.
In Vitro Methyltransferase Activity Assay
IC50
13.0±n/a nM
Citation
 Jin, YChen, XCheng, PBu, PZhang, LWen, CLiu, YZhou, FWeng, MLan, J Sulfuryl-substituted benzoheterocyclic derivative, preparation method and medical use thereof US Patent  US10793549 Publication Date 10/6/2020 
Target
Name:
Histone-lysine N-methyltransferase EZH2 [Y641F]/Polycomb protein EED/Polycomb protein SUZ12
Synonyms:
PRC2 (EZH2-Y641F)
Type:
Protein
Mol. Mass.:
Description:
Components:
This complex has 3 components.
Component 1
Name:
Polycomb protein SUZ12
Synonyms:
CHET9 Chromatin precipitated E2F target 9 protein Joined to JAZF1 protein Polycomb protein SUZ12 SUZ12 Suppressor of zeste 12 protein homolog
Type:
Protein
Mol. Mass.:
83080.09
Organism:
Homo sapiens (Human)
Description:
Q15022
Residue:
739
  
Component 2
Name:
Polycomb protein EED
Synonyms:
EED WAIT-1 hEED
Type:
Protein
Mol. Mass.:
50201.68
Organism:
Homo sapiens (Human)
Description:
O75530
Residue:
441
  
Component 3
Name:
Histone-lysine N-methyltransferase EZH2 [Y641F]
Synonyms:
EZH2 EZH2_HUMAN KMT6
Type:
Mol. Mass.:
85351.84
Organism:
Homo sapiens (Human)
Description:
Q15910[Y641F]
Residue:
746
  
Inhibitor
Name:
BDBM464527
Synonyms:
US10793549, Compound G-13
Type:
Small organic molecule
Emp. Form.:
C33H39N7O4S
Mol. Mass.:
629.772
SMILES:
CN1CCN(CC1)c1ncc(cn1)-c1cc(C(=O)NCc2c(C)cc(C)[nH]c2=O)c2c(C)cn(c2c1)S(=O)(=O)C1(CC=C)CC1
: