Target
Membrane primary amine oxidase
Ligand
BDBM385389
Substrate
Meas. Tech.
In Vitro Activity Assay
IC50
52.0±5 nM
Citation
 Coates, DAQin, LHWei, YZhou, J Amino pyrimidine ssao inhibitors US Patent  US10793552 Publication Date 10/6/2020 
Target
Name:
Membrane primary amine oxidase
Synonyms:
AOC3 Amine oxidase, copper containing Semicarbazide-sensitive amine oxidase/ Vascular adhesion protein 1 (SSAO/VAP-1) Vascular adhesion protein 1 (VAP-1)
Type:
Protein
Mol. Mass.:
84620.86
Organism:
Homo sapiens (Human)
Description:
Q16853
Residue:
763
  
Inhibitor
Name:
BDBM385389
Synonyms:
(3 S)-1-[5-[(E)-2-(Aminomethyl)-3-fluoro-allyloxy]pyrimidin-2-yl]pyrrolidin-3-ol; Dihydrochloride US10464928, Example 6 | US10793552, Example 6
Type:
Small organic molecule
Emp. Form.:
C12H17FN4O2
Mol. Mass.:
268.2874
SMILES:
NC\C(COc1cnc(nc1)N1CC[C@H](O)C1)=C/F
: