Target
Mu-type opioid receptor
Ligand
BDBM464588
Substrate
Meas. Tech.
Receptor Binding Assay
Ki
69.8±n/a nM
Citation
 Kuehnert, SKoenigs, RMKless, AWegert, ARatcliffe, PJostock, RKoch, TLinz, KSchroeder, W 8-amino-2-oxo-1,3-diaza-spiro-[4.5]-decane derivatives US Patent  US10793556 Publication Date 10/6/2020 
Target
Name:
Mu-type opioid receptor
Synonyms:
M-OR-1 MOR-1 MUOR1 Mu opiate receptor OPRM1 hMOP | mu-type opioid receptor isoform MOR-1
Type:
G Protein-Coupled Receptor (GPCR)
Mol. Mass.:
44789.51
Organism:
Homo sapiens (Human)
Description:
P35372
Residue:
400
  
Inhibitor
Name:
BDBM464588
Synonyms:
CIS-1-(Cyclobutyl-methyl)-8-dimethylamino-3-[2-[2-[2-(2-methoxy-ethoxy)- ethoxy]-ethoxy]-ethyl]-8-phenyl-1,3-diazaspiro[4.5]decan-2-one | US10793556, Example SC_4008
Type:
Small organic molecule
Emp. Form.:
C30H49N3O5
Mol. Mass.:
531.7272
SMILES:
COCCOCCOCCOCCN1C[C@]2(CC[C@@](CC2)(N(C)C)c2ccccc2)N(CC2CCC2)C1=O
: