Target
Mu-type opioid receptor
Ligand
BDBM464598
Substrate
Meas. Tech.
Receptor Binding Assay
Ki
555±n/a nM
Citation
 Kuehnert, SKoenigs, RMKless, AWegert, ARatcliffe, PJostock, RKoch, TLinz, KSchroeder, W 8-amino-2-oxo-1,3-diaza-spiro-[4.5]-decane derivatives US Patent  US10793556 Publication Date 10/6/2020 
Target
Name:
Mu-type opioid receptor
Synonyms:
M-OR-1 MOR-1 MUOR1 Mu opiate receptor OPRM1 hMOP | mu-type opioid receptor isoform MOR-1
Type:
G Protein-Coupled Receptor (GPCR)
Mol. Mass.:
44789.51
Organism:
Homo sapiens (Human)
Description:
P35372
Residue:
400
  
Inhibitor
Name:
BDBM464598
Synonyms:
CIS-3-[1-[(1-Hydroxy-cyclobutyl)-methyl]-8-methylamino-2-oxo-8-phenyl-1,3- diazaspiro[4.5]decan-3-yl]-propionitrile US10793556, Example SC_4024 US10793556, Example SC_4026
Type:
Small organic molecule
Emp. Form.:
C27H42N4O3
Mol. Mass.:
470.6474
SMILES:
CN(C)[C@]1(CC[C@]2(CN(CCN3CCOCC3)C(=O)N2CC2(O)CCC2)CC1)c1ccccc1
: