Target
Mu-type opioid receptor
Ligand
BDBM464605
Substrate
Meas. Tech.
Receptor Binding Assay
Ki
1290±n/a nM
Citation
 Kuehnert, SKoenigs, RMKless, AWegert, ARatcliffe, PJostock, RKoch, TLinz, KSchroeder, W 8-amino-2-oxo-1,3-diaza-spiro-[4.5]-decane derivatives US Patent  US10793556 Publication Date 10/6/2020 
Target
Name:
Mu-type opioid receptor
Synonyms:
M-OR-1 MOR-1 MUOR1 Mu opiate receptor OPRM1 hMOP | mu-type opioid receptor isoform MOR-1
Type:
G Protein-Coupled Receptor (GPCR)
Mol. Mass.:
44789.51
Organism:
Homo sapiens (Human)
Description:
P35372
Residue:
400
  
Inhibitor
Name:
BDBM464605
Synonyms:
CIS-1-(Cyclopropyl-methyl)-8-dimethylamino-3-(2-methylsulfonyl-ethyl)-8- phenyl-1,3-diazaspiro[4.5]decan-2-one US10793556, Example SC_4035 US10793556, Example SC_4037 US10793556, Example SC_4039
Type:
Small organic molecule
Emp. Form.:
C27H41N3O4S
Mol. Mass.:
503.697
SMILES:
CN(C)[C@]1(CC[C@]2(CN(CC3CCS(=O)(=O)CC3)C(=O)N2CC2(O)CCC2)CC1)c1ccccc1
: