Target
Nociceptin receptor
Ligand
BDBM464626
Substrate
Meas. Tech.
Receptor Binding Assay
Ki
54.0±n/a nM
Citation
 Kuehnert, SKoenigs, RMKless, AWegert, ARatcliffe, PJostock, RKoch, TLinz, KSchroeder, W 8-amino-2-oxo-1,3-diaza-spiro-[4.5]-decane derivatives US Patent  US10793556 Publication Date 10/6/2020 
Target
Name:
Nociceptin receptor
Synonyms:
KOR-3 Mu-type opioid receptor (Mu) Nociceptin Receptor (ORL1 Receptor) Nociceptin receptor (ORL-1) Nociceptin/Orphanin FQ, NOP receptor OPIATE ORL-1 OPRL1 protein ORL1 Opioid receptor like-1 Orphanin FQ receptor (ORL1) | P41146
Type:
G Protein-Coupled Receptor (GPCR)
Mol. Mass.:
40702.87
Organism:
Homo sapiens (Human)
Description:
P41146
Residue:
370
  
Inhibitor
Name:
BDBM464626
Synonyms:
CIS-1-(Cyclopropyl-methyl)-8-dimethylamino-8-phenyl-3-piperidin-4-yl-1,3- diazaspiro[4.5]decan-2-one US10793556, Example SC_4055 US10793556, Example SC_4057 | US10793556, Example SC_4058
Type:
Small organic molecule
Emp. Form.:
C29H40N6O
Mol. Mass.:
488.6675
SMILES:
CN(C)[C@]1(CC[C@]2(CN(C3CCN(CC3)c3cncnc3)C(=O)N2CC2CC2)CC1)c1ccccc1
: