Target
eIF-2-alpha kinase GCN2
Ligand
BDBM464790
Substrate
Meas. Tech.
Enzyme Inhibition Assay
Ki
<10±n/a nM
Citation
 Bleich, MCharrier, JDong, HDurrant, SEno, MSEtxebarria I Jardi, GEveritt, SFraysse, DKnegtel, RMochalkin, INorth, KPorichis, FQiu, HPullin, RStorck, PTwin, HCXiao, Y GCN2 inhibitors and uses thereof US Patent  US10793563 Publication Date 10/6/2020 
Target
Name:
eIF-2-alpha kinase GCN2
Synonyms:
E2AK4_HUMAN Eukaryotic translation initiation factor 2-alpha kinase 4 GCN2(Kin.Dom.2 S808G) KIAA1338
Type:
PROTEIN
Mol. Mass.:
186899.26
Organism:
Homo sapiens (Human)
Description:
ChEMBL_1495738
Residue:
1649
  
Inhibitor
Name:
BDBM464790
Synonyms:
US10793563, Compound I-484
Type:
Small organic molecule
Emp. Form.:
C20H22ClN7O
Mol. Mass.:
411.888
SMILES:
CC1C(N(CCN1c1ccnc(n1)-c1cnc2ccc(Cl)cn12)C1CC1)C(N)=O
: