Target
Integrin alpha-5/beta-6
Ligand
BDBM465284
Substrate
Meas. Tech.
Binding Assay
IC50
<50.0±n/a nM
Citation
 Cha, JDong, CHom, TJiang, LLeftheris, KLi, HMorgans, Jr., DJMunoz, MReilly, MZheng, Y Amino acid compounds and methods of use US Patent  US10793564 Publication Date 10/6/2020 
Target
Name:
Integrin alpha-5/beta-6
Synonyms:
Integrin alpha-V/alpha-5 | Integrin alpha5beta6
Type:
Enzyme
Mol. Mass.:
Description:
Components:
This complex has 2 components.
Component 1
Name:
Integrin beta-6
Synonyms:
ITB6_HUMAN | ITGB6
Type:
PROTEIN
Mol. Mass.:
85919.61
Organism:
Homo sapiens (Human)
Description:
EBI_10916
Residue:
788
  
Component 2
Name:
Integrin alpha-5
Synonyms:
CD49 antigen-like family member E FNRA Fibronectin receptor subunit alpha ITGA5 Integrin alpha-F | VLA-5
Type:
Single-pass type I membrane protein
Mol. Mass.:
114523.00
Organism:
Homo sapiens (Human)
Description:
Residue:
1049
  
Inhibitor
Name:
BDBM465284
Synonyms:
US10793564, Compound 73 US11560376, Compound 73 US20230293519, Compound 73
Type:
Small organic molecule
Emp. Form.:
C30H40N6O3
Mol. Mass.:
532.677
SMILES:
CO[C@H](C)CN(CCCCc1ccc2CCCNc2n1)CC[C@H](Nc1ccnc(n1)-c1ccccc1)C(O)=O
: