Target
Integrin alpha-5/beta-6
Ligand
BDBM465296
Substrate
Meas. Tech.
Binding Assay
IC50
625±n/a nM
Citation
 Cha, JDong, CHom, TJiang, LLeftheris, KLi, HMorgans, Jr., DJMunoz, MReilly, MZheng, Y Amino acid compounds and methods of use US Patent  US10793564 Publication Date 10/6/2020 
Target
Name:
Integrin alpha-5/beta-6
Synonyms:
Integrin alpha-V/alpha-5 | Integrin alpha5beta6
Type:
Enzyme
Mol. Mass.:
Description:
Components:
This complex has 2 components.
Component 1
Name:
Integrin beta-6
Synonyms:
ITB6_HUMAN | ITGB6
Type:
PROTEIN
Mol. Mass.:
85919.61
Organism:
Homo sapiens (Human)
Description:
EBI_10916
Residue:
788
  
Component 2
Name:
Integrin alpha-5
Synonyms:
CD49 antigen-like family member E FNRA Fibronectin receptor subunit alpha ITGA5 Integrin alpha-F | VLA-5
Type:
Single-pass type I membrane protein
Mol. Mass.:
114523.00
Organism:
Homo sapiens (Human)
Description:
Residue:
1049
  
Inhibitor
Name:
BDBM465296
Synonyms:
US10793564, Compound 85 US11560376, Compound 85 | US20230271960, Compound 85
Type:
Small organic molecule
Emp. Form.:
C25H34F4N6O3
Mol. Mass.:
542.5695
SMILES:
COC[C@@H](F)CN(CCCCc1ccc2CCCNc2n1)CC[C@H](Nc1ncc(cn1)C(F)(F)F)C(O)=O
: