Target
Tyrosine-protein kinase BTK
Ligand
BDBM444646
Substrate
Meas. Tech.
Kinases Assay
IC50
55±n/a nM
Citation
 Liao, XLi, JLu, ZZhou, YGao, A Bruton's tyrosine kinase inhibitors US Patent  US10793566 Publication Date 10/6/2020 
Target
Name:
Tyrosine-protein kinase BTK
Synonyms:
AGMX1 Agammaglobulinaemia tyrosine kinase B cell progenitor kinase BPK BTK_HUMAN Tyrosine Kinase BTK Tyrosine-protein kinase BTK (BTK)
Type:
Enzyme
Mol. Mass.:
76289.95
Organism:
Homo sapiens (Human)
Description:
Q06187
Residue:
659
  
Inhibitor
Name:
BDBM444646
Synonyms:
(R)-1-(3-(3-(4-(3-fluoro-2- methylphenoxy)phenyl)-1H-pyrazolo[4,3- c]pyridin-1-yl)piperidin-1-yl)prop-2-en-1- one US10793566, Compound 16
Type:
Small organic molecule
Emp. Form.:
C27H25FN4O2
Mol. Mass.:
456.5114
SMILES:
Cc1c(F)cccc1Oc1ccc(cc1)-c1nn([C@@H]2CCCN(C2)C(=O)C=C)c2ccncc12
: