Target
Tyrosine-protein kinase BTK
Ligand
BDBM444676
Substrate
Meas. Tech.
Kinases Assay
IC50
>10000±n/a nM
Citation
 Liao, XLi, JLu, ZZhou, YGao, A Bruton's tyrosine kinase inhibitors US Patent  US10793566 Publication Date 10/6/2020 
Target
Name:
Tyrosine-protein kinase BTK
Synonyms:
AGMX1 Agammaglobulinaemia tyrosine kinase B cell progenitor kinase BPK BTK_HUMAN Tyrosine Kinase BTK Tyrosine-protein kinase BTK (BTK)
Type:
Enzyme
Mol. Mass.:
76289.95
Organism:
Homo sapiens (Human)
Description:
Q06187
Residue:
659
  
Inhibitor
Name:
BDBM444676
Synonyms:
(R)-1-(3-(5-acryloyl-3-(4-(2-fluoro-3- methoxyphenoxy)phenyl)-4,5,6,7- tetrahydro-1H-pyrazolo[4,3-c]pyridin-1- yl)pyrrolidin-1-yl)prop-2-en-1-one US10793566, Compound 46
Type:
Small organic molecule
Emp. Form.:
C29H29FN4O4
Mol. Mass.:
516.5634
SMILES:
COc1cccc(Oc2ccc(cc2)-c2nn([C@@H]3CCN(C3)C(=O)C=C)c3CCN(Cc23)C(=O)C=C)c1F
: