Target
Tyrosine-protein kinase BTK
Ligand
BDBM444745
Substrate
Meas. Tech.
Kinases Assay
IC50
550±n/a nM
Citation
 Liao, XLi, JLu, ZZhou, YGao, A Bruton's tyrosine kinase inhibitors US Patent  US10793566 Publication Date 10/6/2020 
Target
Name:
Tyrosine-protein kinase BTK
Synonyms:
AGMX1 Agammaglobulinaemia tyrosine kinase B cell progenitor kinase BPK BTK_HUMAN Tyrosine Kinase BTK Tyrosine-protein kinase BTK (BTK)
Type:
Enzyme
Mol. Mass.:
76289.95
Organism:
Homo sapiens (Human)
Description:
Q06187
Residue:
659
  
Inhibitor
Name:
BDBM444745
Synonyms:
(R)-1-(3-(3-(4-(4- (methylsulfonyl)piperazin-1-yl)phenyl)- 1H- pyrazolo[4,3-c]pyridin-1-yl)piperidin-1- yl)prop-2-en-1-one US10793566, Compound 115
Type:
Small organic molecule
Emp. Form.:
C25H30N6O3S
Mol. Mass.:
494.609
SMILES:
CS(=O)(=O)N1CCN(CC1)c1ccc(cc1)-c1nn(C2CCCN(C2)C(=O)C=C)c2ccncc12
: