Target
Tyrosine-protein kinase BTK
Ligand
BDBM444747
Substrate
Meas. Tech.
Kinases Assay
IC50
55±n/a nM
Citation
 Liao, XLi, JLu, ZZhou, YGao, A Bruton's tyrosine kinase inhibitors US Patent  US10793566 Publication Date 10/6/2020 
Target
Name:
Tyrosine-protein kinase BTK
Synonyms:
AGMX1 Agammaglobulinaemia tyrosine kinase B cell progenitor kinase BPK BTK_HUMAN Tyrosine Kinase BTK Tyrosine-protein kinase BTK (BTK)
Type:
Enzyme
Mol. Mass.:
76289.95
Organism:
Homo sapiens (Human)
Description:
Q06187
Residue:
659
  
Inhibitor
Name:
BDBM444747
Synonyms:
(R)-N-(4-(1-(1-acryloylpiperidin-3- yl)-1H-pyrazolo[4,3-c]pyridin-3- yl)phenyl)-3- (trifluoromethyl)benzamide US10793566, Compound 117
Type:
Small organic molecule
Emp. Form.:
C28H24F3N5O2
Mol. Mass.:
519.5177
SMILES:
FC(F)(F)c1cccc(c1)C(=O)Nc1ccc(cc1)-c1nn([C@@H]2CCCN(C2)C(=O)C=C)c2ccncc12
: