Target
Histone deacetylase 2
Ligand
BDBM465368
Substrate
Meas. Tech.
Enzymatic Assay
IC50
>1500±n/a nM
Citation
 Fuller, NOLowe, III, JA Bicyclic inhibitors of histone deacetylase US Patent  US10793567 Publication Date 10/6/2020 
Target
Name:
Histone deacetylase 2
Synonyms:
Cereblon/Histone deacetylase 2 HDAC2 Histone deacetylase 2 (HDAC2) | Human HDAC2
Type:
Chromatin regulator; hydrolase; repressor
Mol. Mass.:
55356.54
Organism:
Homo sapiens (Human)
Description:
Q92769
Residue:
488
  
Inhibitor
Name:
BDBM465368
Synonyms:
US10793567, Compound 2 | US11225479, Compound 2
Type:
Small organic molecule
Emp. Form.:
C17H15FN6OS
Mol. Mass.:
370.404
SMILES:
Cc1ncc2CN(Cc2n1)C(=O)Nc1nc(ccc1N)-c1ccc(F)s1
: