Target
Histone deacetylase 2
Ligand
BDBM465373
Substrate
Meas. Tech.
Enzymatic Assay
IC50
>1500±n/a nM
Citation
 Fuller, NOLowe, III, JA Bicyclic inhibitors of histone deacetylase US Patent  US10793567 Publication Date 10/6/2020 
Target
Name:
Histone deacetylase 2
Synonyms:
Cereblon/Histone deacetylase 2 HDAC2 Histone deacetylase 2 (HDAC2) | Human HDAC2
Type:
Chromatin regulator; hydrolase; repressor
Mol. Mass.:
55356.54
Organism:
Homo sapiens (Human)
Description:
Q92769
Residue:
488
  
Inhibitor
Name:
BDBM465373
Synonyms:
US10793567, Compound 7 | US11225479, Compound 7
Type:
Small organic molecule
Emp. Form.:
C19H19FN6O
Mol. Mass.:
366.3922
SMILES:
Cc1nc2CN(Cc2n1C)C(=O)Nc1nc(ccc1N)-c1ccc(F)cc1
: