Target
Histone deacetylase 1
Ligand
BDBM465379
Substrate
Meas. Tech.
Enzymatic Assay
IC50
>1500±n/a nM
Citation
 Fuller, NOLowe, III, JA Bicyclic inhibitors of histone deacetylase US Patent  US10793567 Publication Date 10/6/2020 
Target
Name:
Histone deacetylase 1
Synonyms:
Cereblon/Histone deacetylase 1 HDAC1 Histone deacetylase 1 (HDAC1) RPD3L1
Type:
Enzyme
Mol. Mass.:
55090.27
Organism:
Homo sapiens (Human)
Description:
Q13547
Residue:
482
  
Inhibitor
Name:
BDBM465379
Synonyms:
US10793567, Compound 15
Type:
Small organic molecule
Emp. Form.:
C20H18F2N6O
Mol. Mass.:
396.3933
SMILES:
Nc1ccc(nc1NC(=O)N1Cc2cnc(CC(F)F)cc2C1)-c1cccnc1
: