Target
Bile acid receptor
Ligand
BDBM465404
Substrate
Meas. Tech.
Binding Assay
EC50
3162±n/a nM
Citation
 Chao, JJain, RHu, LLewis, JGBaribault, HCaldwell, J Hormone receptor modulators for treating metabolic conditions and disorders US Patent  US10793568 Publication Date 10/6/2020 
Target
Name:
Bile acid receptor
Synonyms:
BAR FXR HRR1 NR1H4_HUMAN RIP14 Retinoid X receptor-interacting protein 14 | farnesoid x receptor
Type:
Nuclear Receptor
Mol. Mass.:
55916.24
Organism:
Homo sapiens (Human)
Description:
Q96RI1
Residue:
486
  
Inhibitor
Name:
BDBM465404
Synonyms:
US10793568, Compound I-23
Type:
Small organic molecule
Emp. Form.:
C27H28F3N3O6S
Mol. Mass.:
579.588
SMILES:
OC(=O)c1cc(OC(F)(F)F)c2nc(sc2c1)N1C[C@@H]2C[C@H]1C[C@H]2OCc1c(onc1C1CCOCC1)C1CC1
: