Target
Bile acid receptor
Ligand
BDBM465399
Substrate
Meas. Tech.
Binding Assay
EC50
0.200±n/a nM
Citation
 Chao, JJain, RHu, LLewis, JGBaribault, HCaldwell, J Hormone receptor modulators for treating metabolic conditions and disorders US Patent  US10793568 Publication Date 10/6/2020 
Target
Name:
Bile acid receptor
Synonyms:
BAR FXR HRR1 NR1H4_HUMAN RIP14 Retinoid X receptor-interacting protein 14 | farnesoid x receptor
Type:
Nuclear Receptor
Mol. Mass.:
55916.24
Organism:
Homo sapiens (Human)
Description:
Q96RI1
Residue:
486
  
Inhibitor
Name:
BDBM465399
Synonyms:
US10793568, Compound I-18
Type:
Small organic molecule
Emp. Form.:
C29H27Cl2N3O5S
Mol. Mass.:
600.513
SMILES:
CCOc1cc(cc2sc(nc12)N1C[C@@H]2C[C@H]1C[C@H]2OCc1c(onc1-c1c(Cl)cccc1Cl)C1CC1)C(O)=O
: