Target
Non-receptor tyrosine-protein kinase TYK2 [556-888]
Ligand
BDBM399623
Substrate
Meas. Tech.
TYK2 JH2 Domain Binding Assay
Kd
5.5±n/a nM
Citation
 Greenwood, JRHarriman, GCLeit de Moradei, SMMasse, CEMcLean, THMondal, S TYK2 inhibitors and uses thereof US Patent  US10793574 Publication Date 10/6/2020 
Target
Name:
Non-receptor tyrosine-protein kinase TYK2 [556-888]
Synonyms:
Non-receptor tyrosine-protein kinase TYK2 (G556-D888) TYK2 TYK2_HUMAN
Type:
Protein
Mol. Mass.:
36941.98
Organism:
Homo sapiens (Human)
Description:
P29597 (aa 556-888)
Residue:
333
  
Inhibitor
Name:
BDBM399623
Synonyms:
US10323036, Compound I-67 US11220508, Compound I-67
Type:
Small organic molecule
Emp. Form.:
C22H21F3N6O3
Mol. Mass.:
474.4357
SMILES:
COCc1ccc(Nc2cc(Nc3cccc(n3)C(F)(F)F)nc3[nH]n(C)c(=O)c23)c(OC)c1
: