Target
Non-receptor tyrosine-protein kinase TYK2 [556-888]
Ligand
BDBM399683
Substrate
Meas. Tech.
TYK2 JH2 Domain Binding Assay
Kd
>10±n/a nM
Citation
 Greenwood, JRHarriman, GCLeit de Moradei, SMMasse, CEMcLean, THMondal, S TYK2 inhibitors and uses thereof US Patent  US10793574 Publication Date 10/6/2020 
Target
Name:
Non-receptor tyrosine-protein kinase TYK2 [556-888]
Synonyms:
Non-receptor tyrosine-protein kinase TYK2 (G556-D888) TYK2 TYK2_HUMAN
Type:
Protein
Mol. Mass.:
36941.98
Organism:
Homo sapiens (Human)
Description:
P29597 (aa 556-888)
Residue:
333
  
Inhibitor
Name:
BDBM399683
Synonyms:
US10323036, Compound I-127 US11220508, Compound I-127
Type:
Small organic molecule
Emp. Form.:
C18H17F2N5O3
Mol. Mass.:
389.3561
SMILES:
COc1c(Nc2cc(NC(=O)C3CC3)nc3[nH]n(C)c(=O)c23)ccc(F)c1F
: