Target
Non-receptor tyrosine-protein kinase TYK2 [556-888]
Ligand
BDBM399738
Substrate
Meas. Tech.
TYK2 JH2 Domain Binding Assay
Kd
0.3±n/a nM
Citation
 Greenwood, JRHarriman, GCLeit de Moradei, SMMasse, CEMcLean, THMondal, S TYK2 inhibitors and uses thereof US Patent  US10793574 Publication Date 10/6/2020 
Target
Name:
Non-receptor tyrosine-protein kinase TYK2 [556-888]
Synonyms:
Non-receptor tyrosine-protein kinase TYK2 (G556-D888) TYK2 TYK2_HUMAN
Type:
Protein
Mol. Mass.:
36941.98
Organism:
Homo sapiens (Human)
Description:
P29597 (aa 556-888)
Residue:
333
  
Inhibitor
Name:
BDBM399738
Synonyms:
US10323036, Compound I-226 US11220508, Compound I-226
Type:
Small organic molecule
Emp. Form.:
C22H23N7O4S
Mol. Mass.:
481.528
SMILES:
CN(c1ccccc1Nc1cc(Nc2cc3CCOc3cn2)nc2[nH]n(C)c(=O)c12)S(C)(=O)=O
: