Target
Tyrosine-protein kinase BTK
Ligand
BDBM465755
Substrate
Meas. Tech.
Inhibition Activity Assay
IC50
55±n/a nM
Citation
 Kawahata, WKiyoi, TIrie, TAsami, TSawa, MKashimoto, S Oxoisoquinoline derivatives US Patent  US10793575 Publication Date 10/6/2020 
Target
Name:
Tyrosine-protein kinase BTK
Synonyms:
AGMX1 Agammaglobulinaemia tyrosine kinase B cell progenitor kinase BPK BTK_HUMAN Tyrosine Kinase BTK Tyrosine-protein kinase BTK (BTK)
Type:
Enzyme
Mol. Mass.:
76289.95
Organism:
Homo sapiens (Human)
Description:
Q06187
Residue:
659
  
Inhibitor
Name:
BDBM465755
Synonyms:
N-({2-amino-4- [3-(6-cyclopropyl- 8-fluoro-1-oxoisoquinolin- 2(1H)-yl)-2-(hydroxy- methyl)phenyl]-7H- pyrrolo[2,3-d]pyrimidin- 6-yl}methyl)acrylamide | US10793575, Example 30
Type:
Small organic molecule
Emp. Form.:
C29H25FN6O3
Mol. Mass.:
524.5456
SMILES:
Nc1nc(-c2cccc(c2CO)-n2ccc3cc(cc(F)c3c2=O)C2CC2)c2cc(CNC(=O)C=C)[nH]c2n1
: