Target
Tyrosine-protein kinase BTK [C481S]
Ligand
BDBM468306
Substrate
Meas. Tech.
Inhibitory Activity Assay
IC50
1.60±n/a nM
Citation
 Kawahata, WKiyoi, TIrie, TAsami, TSawa, MKashimoto, S Oxoisoquinoline derivatives US Patent  US10793575 Publication Date 10/6/2020 
Target
Name:
Tyrosine-protein kinase BTK [C481S]
Synonyms:
AGMX1 BPK BTK C481S Tyrosine-protein kinase BTK (C481S) | Tyrosine-protein kinase BTK C481S
Type:
Enzyme Catalytic Domain
Mol. Mass.:
76273.88
Organism:
Homo sapiens (Human)
Description:
Q06187[C481S]
Residue:
659
  
Inhibitor
Name:
BDBM468306
Synonyms:
2-(3-{2-amino-6-[2- (methylamino)pyridin- 4-yl]-7H-pyrrolo[2,3- d]pyrimidin-4-yl}-2- (hydroxy- methyl)phenyl)-6- cyclopropyl-8- fluoroisoquinolin- 1(2H)-one | US10793575, Example 50
Type:
Small organic molecule
Emp. Form.:
C31H26FN7O2
Mol. Mass.:
547.5822
SMILES:
CNc1cc(ccn1)-c1cc2c(nc(N)nc2[nH]1)-c1cccc(c1CO)-n1ccc2cc(cc(F)c2c1=O)C1CC1
: