Target
Tyrosine-protein kinase BTK [C481S]
Ligand
BDBM468313
Substrate
Meas. Tech.
Inhibitory Activity Assay
IC50
0.580±n/a nM
Citation
 Kawahata, WKiyoi, TIrie, TAsami, TSawa, MKashimoto, S Oxoisoquinoline derivatives US Patent  US10793575 Publication Date 10/6/2020 
Target
Name:
Tyrosine-protein kinase BTK [C481S]
Synonyms:
AGMX1 BPK BTK C481S Tyrosine-protein kinase BTK (C481S) | Tyrosine-protein kinase BTK C481S
Type:
Enzyme Catalytic Domain
Mol. Mass.:
76273.88
Organism:
Homo sapiens (Human)
Description:
Q06187[C481S]
Residue:
659
  
Inhibitor
Name:
BDBM468313
Synonyms:
2-(3-{2-amino-6- [1-(4-methylpiperazine-1- carbonyl)-1,2,3,6- tetrahydropyridin-4-yl]- 7H-pyrrolo[2,3- d]pyrimidin-4-yl}- 2-(hydroxy- methyl)phenyl)-6- cyclopropyl- 8-fluoroisoquinolin- 1(2H)-one | US10793575, Example 71
Type:
Small organic molecule
Emp. Form.:
C36H37FN8O3
Mol. Mass.:
648.7292
SMILES:
CN1CCN(CC1)C(=O)N1CCC(=CC1)c1cc2c(nc(N)nc2[nH]1)-c1cccc(c1CO)-n1ccc2cc(cc(F)c2c1=O)C1CC1
: