Target
Tyrosine-protein kinase BTK
Ligand
BDBM468317
Substrate
Meas. Tech.
Inhibition Activity Assay
IC50
0.940±n/a nM
Citation
 Kawahata, WKiyoi, TIrie, TAsami, TSawa, MKashimoto, S Oxoisoquinoline derivatives US Patent  US10793575 Publication Date 10/6/2020 
Target
Name:
Tyrosine-protein kinase BTK
Synonyms:
AGMX1 Agammaglobulinaemia tyrosine kinase B cell progenitor kinase BPK BTK_HUMAN Tyrosine Kinase BTK Tyrosine-protein kinase BTK (BTK)
Type:
Enzyme
Mol. Mass.:
76289.95
Organism:
Homo sapiens (Human)
Description:
Q06187
Residue:
659
  
Inhibitor
Name:
BDBM468317
Synonyms:
2-(3-{2-amino-6-[1- (pyrrolidine-1-carbonyl)- 1,2,3,6- tetrahydropyridin-4-yl]- 7H-pyrrolo[2,3- d]pyrimidin-4-yl}- 2-(hydroxy- methyl)phenyl)-6- cyclopropyl- 8-fluoroisoquinolin- 1(2H)-one | US10793575, Example 88
Type:
Small organic molecule
Emp. Form.:
C35H34FN7O3
Mol. Mass.:
619.688
SMILES:
Nc1nc(-c2cccc(c2CO)-n2ccc3cc(cc(F)c3c2=O)C2CC2)c2cc([nH]c2n1)C1=CCN(CC1)C(=O)N1CCCC1
: