Target
Tyrosine-protein kinase BTK
Ligand
BDBM465779
Substrate
Meas. Tech.
In Vitro Assay for the Inhibition of BTK Kinase Activity
IC50
2.60±n/a nM
Citation
 Li, YHuang, HLiu, GChen, TRen, JSu, Z Compound used as Bruton's tyrosine kinase inhibitor and preparation method and application thereof US Patent  US10793576 Publication Date 10/6/2020 
Target
Name:
Tyrosine-protein kinase BTK
Synonyms:
AGMX1 Agammaglobulinaemia tyrosine kinase B cell progenitor kinase BPK BTK_HUMAN Tyrosine Kinase BTK Tyrosine-protein kinase BTK (BTK)
Type:
Enzyme
Mol. Mass.:
76289.95
Organism:
Homo sapiens (Human)
Description:
Q06187
Residue:
659
  
Inhibitor
Name:
BDBM465779
Synonyms:
US10793576, Example 11
Type:
Small organic molecule
Emp. Form.:
C27H25N7O3
Mol. Mass.:
495.5325
SMILES:
Nc1nccn2c(nc(-c3ccc(cc3)C(=O)Nc3ccccn3)c12)C12CCC(COC1)N2C(=O)C=C
: